Target
Mitogen-activated protein kinase kinase kinase kinase 2
Ligand
BDBM51891
Substrate
Meas. Tech.
Dose Response Confirmation via Multiplex HTS Assay for Inhibitors of MEK Kinase PB1 Domains, specifically MEK5 binding to MEK Kinase 2 Wildtype
EC50
30000±n/a nM
Citation
 PubChem, PC Dose Response Confirmation via Multiplex HTS Assay for Inhibitors of MEK Kinase PB1 Domains, specifically MEK5 binding to MEK Kinase 2 Wildtype PubChem Bioassay (2009)[AID] 
Target
Name:
Mitogen-activated protein kinase kinase kinase kinase 2
Synonyms:
2.7.11.1 GC kinase Germinal center kinase MAP4K2 MEK kinase kinase 2 RAB8IP | Rab8-interacting protein
Type:
Mol. Mass.:
91551.35
Organism:
Homo sapiens (Human)
Description:
Residue:
820
  
Inhibitor
Name:
BDBM51891
Synonyms:
2,5-dimethyl-4-[(phenylmethyl)-propan-2-ylsulfamoyl]-3-furancarboxylic acid methyl ester MLS000850406 cid_2814454 methyl 4-[benzyl(propan-2-yl)sulfamoyl]-2,5-dimethylfuran-3-carboxylate | methyl 4-{[benzyl(isopropyl)amino]sulfonyl}-2,5-dimethyl-3-furoate
Type:
Small organic molecule
Emp. Form.:
C18H23NO5S
Mol. Mass.:
365.444
SMILES:
COC(=O)c1c(C)oc(C)c1S(=O)(=O)N(Cc1ccccc1)C(C)C
: