Target
Mitogen-activated protein kinase kinase kinase kinase 2
Ligand
BDBM51892
Substrate
Meas. Tech.
Dose Response Confirmation via Multiplex HTS Assay for Inhibitors of MEK Kinase PB1 Domains, specifically MEK5 binding to MEK Kinase 2 Wildtype
EC50
30000±n/a nM
Citation
 PubChem, PC Dose Response Confirmation via Multiplex HTS Assay for Inhibitors of MEK Kinase PB1 Domains, specifically MEK5 binding to MEK Kinase 2 Wildtype PubChem Bioassay (2009)[AID] 
Target
Name:
Mitogen-activated protein kinase kinase kinase kinase 2
Synonyms:
2.7.11.1 GC kinase Germinal center kinase MAP4K2 MEK kinase kinase 2 RAB8IP | Rab8-interacting protein
Type:
Mol. Mass.:
91551.35
Organism:
Homo sapiens (Human)
Description:
Residue:
820
  
Inhibitor
Name:
BDBM51892
Synonyms:
5-amino-N-[3-[[4-[(4-ethyl-1-piperazinyl)methyl]-3-(trifluoromethyl)anilino]-oxomethyl]-5-methoxyphenyl]-1-phenyl-4-pyrazolecarboxamide 5-amino-N-[3-[[4-[(4-ethylpiperazino)methyl]-3-(trifluoromethyl)phenyl]carbamoyl]-5-methoxy-phenyl]-1-phenyl-pyrazole-4-carboxamide MLS000911569 cid_16746086
Type:
Small organic molecule
Emp. Form.:
C32H34F3N7O3
Mol. Mass.:
621.6527
SMILES:
CCN1CCN(Cc2ccc(NC(=O)c3cc(NC(=O)c4cnn(c4N)-c4ccccc4)cc(OC)c3)cc2C(F)(F)F)CC1
: