Target
Mitogen-activated protein kinase kinase kinase kinase 2
Ligand
BDBM51897
Substrate
Meas. Tech.
Dose Response Confirmation via Multiplex HTS Assay for Inhibitors of MEK Kinase PB1 Domains, specifically MEK5 binding to MEK Kinase 2 Wildtype
EC50
30000±n/a nM
Citation
 PubChem, PC Dose Response Confirmation via Multiplex HTS Assay for Inhibitors of MEK Kinase PB1 Domains, specifically MEK5 binding to MEK Kinase 2 Wildtype PubChem Bioassay (2009)[AID] 
Target
Name:
Mitogen-activated protein kinase kinase kinase kinase 2
Synonyms:
2.7.11.1 GC kinase Germinal center kinase MAP4K2 MEK kinase kinase 2 RAB8IP | Rab8-interacting protein
Type:
Mol. Mass.:
91551.35
Organism:
Homo sapiens (Human)
Description:
Residue:
820
  
Inhibitor
Name:
BDBM51897
Synonyms:
4-amyl-5,7-dimethoxy-8-[1-(4-methoxyphenyl)-3-piperidino-propyl]coumarin 5,7-dimethoxy-8-[1-(4-methoxyphenyl)-3-piperidin-1-yl-propyl]-4-pentyl-chromen-2-one MLS000879434 cid_16746323
Type:
Small organic molecule
Emp. Form.:
C31H41NO5
Mol. Mass.:
507.6609
SMILES:
CCCCCc1cc(=O)oc2c(C(CCN3CCCCC3)c3ccc(OC)cc3)c(OC)cc(OC)c12
: