Target
Mitogen-activated protein kinase kinase kinase kinase 2
Ligand
BDBM51921
Substrate
Meas. Tech.
Dose Response Confirmation via Multiplex HTS Assay for Inhibitors of MEK Kinase PB1 Domains, specifically MEK5 binding to MEK Kinase 2 Wildtype
EC50
30000±n/a nM
Citation
 PubChem, PC Dose Response Confirmation via Multiplex HTS Assay for Inhibitors of MEK Kinase PB1 Domains, specifically MEK5 binding to MEK Kinase 2 Wildtype PubChem Bioassay (2009)[AID] 
Target
Name:
Mitogen-activated protein kinase kinase kinase kinase 2
Synonyms:
2.7.11.1 GC kinase Germinal center kinase MAP4K2 MEK kinase kinase 2 RAB8IP | Rab8-interacting protein
Type:
Mol. Mass.:
91551.35
Organism:
Homo sapiens (Human)
Description:
Residue:
820
  
Inhibitor
Name:
BDBM51921
Synonyms:
(2Z)-3-ethyl-2-[(2E,4E,6E)-7-(3-ethyl-1,3-benzothiazol-3-ium-2-yl)hepta-2,4,6-trienylidene]-1,3-benzothiazole;iodide MLS001194940 cid_5702699
Type:
Small organic molecule
Emp. Form.:
C25H25N2S2
Mol. Mass.:
417.609
SMILES:
CCN1\C(Sc2ccccc12)=C\C=C\C=C\C=C\c1sc2ccccc2[n+]1CC
: