Target
Mitogen-activated protein kinase kinase kinase kinase 2
Ligand
BDBM51928
Substrate
Meas. Tech.
Dose Response Confirmation via Multiplex HTS Assay for Inhibitors of MEK Kinase PB1 Domains, specifically MEK5 binding to MEK Kinase 2 Wildtype
EC50
30000±n/a nM
Citation
 PubChem, PC Dose Response Confirmation via Multiplex HTS Assay for Inhibitors of MEK Kinase PB1 Domains, specifically MEK5 binding to MEK Kinase 2 Wildtype PubChem Bioassay (2009)[AID] 
Target
Name:
Mitogen-activated protein kinase kinase kinase kinase 2
Synonyms:
2.7.11.1 GC kinase Germinal center kinase MAP4K2 MEK kinase kinase 2 RAB8IP | Rab8-interacting protein
Type:
Mol. Mass.:
91551.35
Organism:
Homo sapiens (Human)
Description:
Residue:
820
  
Inhibitor
Name:
BDBM51928
Synonyms:
MLS001090557 N-[3-(3-chlorophenyl)phenyl]-1-[(1-propan-2-yl-4-pyrazolyl)methyl]-4-piperidinecarboxamide SMR000664674 | cid_24790786
Type:
Small organic molecule
Emp. Form.:
C25H29ClN4O
Mol. Mass.:
436.977
SMILES:
CC(C)n1cc(CN2CCC(CC2)C(=O)Nc2cccc(c2)-c2cccc(Cl)c2)cn1
: