Target
Beta-lactamase
Ligand
BDBM51987
Substrate
Meas. Tech.
Epi-absorbance-based dose response biochemical high throughput screening assay for selective inhibitors of VIM-2 metallo-beta-lactamase
IC50
6640±n/a nM
Citation
 PubChem, PC Epi-absorbance-based dose response biochemical high throughput screening assay for selective inhibitors of VIM-2 metallo-beta-lactamase PubChem Bioassay (2009)[AID] 
Target
Name:
Beta-lactamase
Synonyms:
Beta lactamase
Type:
Enzyme Catalytic Domain
Mol. Mass.:
31513.38
Organism:
Pseudomonas aeruginosa
Description:
gi_114881106
Residue:
286
  
Inhibitor
Name:
BDBM51987
Synonyms:
MLS000624309 N-[5-[2-(furan-2-ylmethylamino)-2-oxoethyl]sulfanyl-1,3,4-thiadiazol-2-yl]cyclohexanecarboxamide N-[5-[[2-(2-furfurylamino)-2-keto-ethyl]thio]-1,3,4-thiadiazol-2-yl]cyclohexanecarboxamide cid_7190957
Type:
Small organic molecule
Emp. Form.:
C16H20N4O3S2
Mol. Mass.:
380.485
SMILES:
O=C(CSc1nnc(NC(=O)C2CCCCC2)s1)NCc1ccco1
: