Target
Beta-lactamase
Ligand
BDBM43230
Substrate
Meas. Tech.
Epi-absorbance-based dose response biochemical high throughput screening assay for selective inhibitors of VIM-2 metallo-beta-lactamase
IC50
10470±n/a nM
Citation
 PubChem, PC Epi-absorbance-based dose response biochemical high throughput screening assay for selective inhibitors of VIM-2 metallo-beta-lactamase PubChem Bioassay (2009)[AID] 
Target
Name:
Beta-lactamase
Synonyms:
Beta lactamase
Type:
Enzyme Catalytic Domain
Mol. Mass.:
31513.38
Organism:
Pseudomonas aeruginosa
Description:
gi_114881106
Residue:
286
  
Inhibitor
Name:
BDBM43230
Synonyms:
2-(7,8-dihydro-6H-cyclopenta[2,3]thieno[2,4-d]pyrimidin-1-ylsulfanyl)benzoic acid MLS000774547 cid_2415319
Type:
Small organic molecule
Emp. Form.:
C16H12N2O2S2
Mol. Mass.:
328.409
SMILES:
OC(=O)c1ccccc1Sc1ncnc2sc3CCCc3c12
: