Target
Beta-lactamase
Ligand
BDBM51957
Substrate
Meas. Tech.
Epi-absorbance-based counterscreen for selective VIM-2 inhibitors: dose response biochemical high throughput screening assay to identify inhibitors of IMP-1 metallo-beta-lactamase.
IC50
59640±n/a nM
Citation
 PubChem, PC Epi-absorbance-based counterscreen for selective VIM-2 inhibitors: dose response biochemical high throughput screening assay to identify inhibitors of IMP-1 metallo-beta-lactamase. PubChem Bioassay (2009)[AID] 
Target
Name:
Beta-lactamase
Synonyms:
Beta-lactamase | metallo-beta-lactamase IMP-1
Type:
Enzyme Catalytic Domain
Mol. Mass.:
27125.88
Organism:
Pseudomonas aeruginosa
Description:
gi_27368096
Residue:
246
  
Inhibitor
Name:
BDBM51957
Synonyms:
MLS000122144 N-[5-[2-oxidanylidene-2-(thiophen-2-ylmethylamino)ethyl]sulfanyl-1,3,4-thiadiazol-2-yl]butanamide N-[5-[[2-keto-2-(2-thenylamino)ethyl]thio]-1,3,4-thiadiazol-2-yl]butyramide SMR000119548 | cid_3220527
Type:
Small organic molecule
Emp. Form.:
C13H16N4O2S3
Mol. Mass.:
356.487
SMILES:
CCCC(=O)Nc1nnc(SCC(=O)NCc2cccs2)s1
: