Target
Beta-lactamase
Ligand
BDBM52017
Substrate
Meas. Tech.
Epi-absorbance-based counterscreen for selective VIM-2 inhibitors: dose response biochemical high throughput screening assay to identify inhibitors of IMP-1 metallo-beta-lactamase.
IC50
59640±n/a nM
Citation
 PubChem, PC Epi-absorbance-based counterscreen for selective VIM-2 inhibitors: dose response biochemical high throughput screening assay to identify inhibitors of IMP-1 metallo-beta-lactamase. PubChem Bioassay (2009)[AID] 
Target
Name:
Beta-lactamase
Synonyms:
Beta-lactamase | metallo-beta-lactamase IMP-1
Type:
Enzyme Catalytic Domain
Mol. Mass.:
27125.88
Organism:
Pseudomonas aeruginosa
Description:
gi_27368096
Residue:
246
  
Inhibitor
Name:
BDBM52017
Synonyms:
2,6-Dibromo-4-[(3-mercapto-5-phenyl-[1,2,4]triazol-4-ylimino)-methyl]-phenol 2,6-dibromo-4-[[(3-phenyl-5-sulfanylidene-1H-1,2,4-triazol-4-yl)amino]methylidene]-1-cyclohexa-2,5-dienone 2,6-dibromo-4-[[(3-phenyl-5-thioxo-1H-1,2,4-triazol-4-yl)amino]methylene]cyclohexa-2,5-dien-1-one SMR000513433 | cid_5753333
Type:
Small organic molecule
Emp. Form.:
C15H10Br2N4OS
Mol. Mass.:
454.139
SMILES:
Oc1c(Br)cc(C=Nn2c(n[nH]c2=S)-c2ccccc2)cc1Br
: