Target
Beta-lactamase
Ligand
BDBM52020
Substrate
Meas. Tech.
Epi-absorbance-based counterscreen for selective VIM-2 inhibitors: dose response biochemical high throughput screening assay to identify inhibitors of IMP-1 metallo-beta-lactamase.
IC50
59640±n/a nM
Citation
 PubChem, PC Epi-absorbance-based counterscreen for selective VIM-2 inhibitors: dose response biochemical high throughput screening assay to identify inhibitors of IMP-1 metallo-beta-lactamase. PubChem Bioassay (2009)[AID] 
Target
Name:
Beta-lactamase
Synonyms:
Beta-lactamase | metallo-beta-lactamase IMP-1
Type:
Enzyme Catalytic Domain
Mol. Mass.:
27125.88
Organism:
Pseudomonas aeruginosa
Description:
gi_27368096
Residue:
246
  
Inhibitor
Name:
BDBM52020
Synonyms:
(2S)-2-[2-[(3,4,8,8-tetramethyl-2-oxidanylidene-9,10-dihydropyrano[2,3-h]chromen-5-yl)oxy]ethanoylamino]propanoic acid (2S)-2-[[2-[(2-keto-3,4,8,8-tetramethyl-9,10-dihydropyrano[2,3-h]chromen-5-yl)oxy]acetyl]amino]propionic acid MLS001215980 cid_8016217
Type:
Small organic molecule
Emp. Form.:
C21H25NO7
Mol. Mass.:
403.4257
SMILES:
C[C@H](NC(=O)COc1cc2OC(C)(C)CCc2c2oc(=O)c(C)c(C)c12)C(O)=O
: