Target
Beta-lactamase
Ligand
BDBM52047
Substrate
Meas. Tech.
Epi-absorbance-based counterscreen for selective VIM-2 inhibitors: dose response biochemical high throughput screening assay to identify inhibitors of IMP-1 metallo-beta-lactamase.
IC50
59640±n/a nM
Citation
 PubChem, PC Epi-absorbance-based counterscreen for selective VIM-2 inhibitors: dose response biochemical high throughput screening assay to identify inhibitors of IMP-1 metallo-beta-lactamase. PubChem Bioassay (2009)[AID] 
Target
Name:
Beta-lactamase
Synonyms:
Beta-lactamase | metallo-beta-lactamase IMP-1
Type:
Enzyme Catalytic Domain
Mol. Mass.:
27125.88
Organism:
Pseudomonas aeruginosa
Description:
gi_27368096
Residue:
246
  
Inhibitor
Name:
BDBM52047
Synonyms:
MLS001237927 N-[5-[2-(furan-2-ylmethylamino)-2-oxoethyl]sulfanyl-1,3,4-thiadiazol-2-yl]-3-methylbenzamide N-[5-[[2-(2-furfurylamino)-2-keto-ethyl]thio]-1,3,4-thiadiazol-2-yl]-3-methyl-benzamide cid_8481773
Type:
Small organic molecule
Emp. Form.:
C17H16N4O3S2
Mol. Mass.:
388.464
SMILES:
Cc1cccc(c1)C(=O)Nc1nnc(SCC(=O)NCc2ccco2)s1
: