Target
Beta-lactamase
Ligand
BDBM51946
Substrate
Meas. Tech.
FRET-based counterscreen for selective VIM-2 inhibitors: dose response biochemical high throughput screening assay to identify epi-absorbance assay artifacts.
IC50
3966±n/a nM
Citation
 PubChem, PC FRET-based counterscreen for selective VIM-2 inhibitors: dose response biochemical high throughput screening assay to identify epi-absorbance assay artifacts. PubChem Bioassay (2009)[AID] 
Target
Name:
Beta-lactamase
Synonyms:
Beta lactamase
Type:
Enzyme Catalytic Domain
Mol. Mass.:
31513.38
Organism:
Pseudomonas aeruginosa
Description:
gi_114881106
Residue:
286
  
Inhibitor
Name:
BDBM51946
Synonyms:
3-(2-furanyl)-4-(1-naphthalenyl)-1H-1,2,4-triazole-5-thione 3-(furan-2-yl)-4-naphthalen-1-yl-1H-1,2,4-triazole-5-thione SMR000059244 | cid_660813
Type:
Small organic molecule
Emp. Form.:
C16H11N3OS
Mol. Mass.:
293.343
SMILES:
S=c1[nH]nc(-c2ccco2)n1-c1cccc2ccccc12
: