Target
Beta-lactamase
Ligand
BDBM52010
Substrate
Meas. Tech.
FRET-based counterscreen for selective VIM-2 inhibitors: dose response biochemical high throughput screening assay to identify epi-absorbance assay artifacts.
IC50
6150±n/a nM
Citation
 PubChem, PC FRET-based counterscreen for selective VIM-2 inhibitors: dose response biochemical high throughput screening assay to identify epi-absorbance assay artifacts. PubChem Bioassay (2009)[AID] 
Target
Name:
Beta-lactamase
Synonyms:
Beta lactamase
Type:
Enzyme Catalytic Domain
Mol. Mass.:
31513.38
Organism:
Pseudomonas aeruginosa
Description:
gi_114881106
Residue:
286
  
Inhibitor
Name:
BDBM52010
Synonyms:
MLS000860923 N-(2-methoxy-1-methyl-ethyl)-7-nitro-1H-indole-2-carboxamide SMR000459707 | cid_2823665
Type:
Small organic molecule
Emp. Form.:
C13H15N3O4
Mol. Mass.:
277.2759
SMILES:
COCC(C)NC(=O)c1cc2cccc([N+]([O-])=O)c2[nH]1
: