Target
Beta-lactamase
Ligand
BDBM52013
Substrate
Meas. Tech.
FRET-based counterscreen for selective VIM-2 inhibitors: dose response biochemical high throughput screening assay to identify epi-absorbance assay artifacts.
IC50
2503±n/a nM
Citation
 PubChem, PC FRET-based counterscreen for selective VIM-2 inhibitors: dose response biochemical high throughput screening assay to identify epi-absorbance assay artifacts. PubChem Bioassay (2009)[AID] 
Target
Name:
Beta-lactamase
Synonyms:
Beta lactamase
Type:
Enzyme Catalytic Domain
Mol. Mass.:
31513.38
Organism:
Pseudomonas aeruginosa
Description:
gi_114881106
Residue:
286
  
Inhibitor
Name:
BDBM52013
Synonyms:
3-methyl-4-[[(Z)-2-methyl-3-phenyl-prop-2-enylidene]amino]-1H-1,2,4-triazole-5-thione 5-methyl-4-[(2-methyl-3-phenyl-2-propen-1-ylidene)amino]-4H-1,2,4-triazole-3-thiol SMR000497434 | cid_1567813
Type:
Small organic molecule
Emp. Form.:
C13H14N4S
Mol. Mass.:
258.342
SMILES:
CC(C=Nn1c(C)n[nH]c1=S)=Cc1ccccc1
: