Target
Beta-lactamase
Ligand
BDBM52036
Substrate
Meas. Tech.
FRET-based counterscreen for selective VIM-2 inhibitors: dose response biochemical high throughput screening assay to identify epi-absorbance assay artifacts.
IC50
5308±n/a nM
Citation
 PubChem, PC FRET-based counterscreen for selective VIM-2 inhibitors: dose response biochemical high throughput screening assay to identify epi-absorbance assay artifacts. PubChem Bioassay (2009)[AID] 
Target
Name:
Beta-lactamase
Synonyms:
Beta lactamase
Type:
Enzyme Catalytic Domain
Mol. Mass.:
31513.38
Organism:
Pseudomonas aeruginosa
Description:
gi_114881106
Residue:
286
  
Inhibitor
Name:
BDBM52036
Synonyms:
(2R)-1-[1-oxo-2-[(3,4,7-trimethyl-2-oxo-1-benzopyran-5-yl)oxy]ethyl]-2-pyrrolidinecarboxylic acid (2R)-1-[2-(3,4,7-trimethyl-2-oxidanylidene-chromen-5-yl)oxyethanoyl]pyrrolidine-2-carboxylic acid MLS001139463 cid_6569514
Type:
Small organic molecule
Emp. Form.:
C19H21NO6
Mol. Mass.:
359.3731
SMILES:
Cc1cc(OCC(=O)N2CCC[C@@H]2C(O)=O)c2c(C)c(C)c(=O)oc2c1
: