Target
Beta-lactamase
Ligand
BDBM52049
Substrate
Meas. Tech.
FRET-based counterscreen for selective VIM-2 inhibitors: dose response biochemical high throughput screening assay to identify epi-absorbance assay artifacts.
IC50
2621±n/a nM
Citation
 PubChem, PC FRET-based counterscreen for selective VIM-2 inhibitors: dose response biochemical high throughput screening assay to identify epi-absorbance assay artifacts. PubChem Bioassay (2009)[AID] 
Target
Name:
Beta-lactamase
Synonyms:
Beta lactamase
Type:
Enzyme Catalytic Domain
Mol. Mass.:
31513.38
Organism:
Pseudomonas aeruginosa
Description:
gi_114881106
Residue:
286
  
Inhibitor
Name:
BDBM52049
Synonyms:
MLS001237928 N-[5-[2-(furan-2-ylmethylamino)-2-oxoethyl]sulfanyl-1,3,4-thiadiazol-2-yl]-2-nitrobenzamide N-[5-[[2-(2-furfurylamino)-2-keto-ethyl]thio]-1,3,4-thiadiazol-2-yl]-2-nitro-benzamide cid_24892372
Type:
Small organic molecule
Emp. Form.:
C16H13N5O5S2
Mol. Mass.:
419.435
SMILES:
[O-][N+](=O)c1ccccc1C(=O)Nc1nnc(SCC(=O)NCc2ccco2)s1
: