Target
Beta-lactamase
Ligand
BDBM51940
Substrate
Meas. Tech.
FRET-based counterscreen for selective VIM-2 inhibitors: dose response biochemical high throughput screening assay to identify inhibitors of IMP-1 metallo-beta-lactamase.
IC50
59640±n/a nM
Citation
 PubChem, PC FRET-based counterscreen for selective VIM-2 inhibitors: dose response biochemical high throughput screening assay to identify inhibitors of IMP-1 metallo-beta-lactamase. PubChem Bioassay (2009)[AID] 
Target
Name:
Beta-lactamase
Synonyms:
Beta-lactamase | metallo-beta-lactamase IMP-1
Type:
Enzyme Catalytic Domain
Mol. Mass.:
27125.88
Organism:
Pseudomonas aeruginosa
Description:
gi_27368096
Residue:
246
  
Inhibitor
Name:
BDBM51940
Synonyms:
MLS000033402 N-[5-[2-(2,6-dimethylpiperidin-1-yl)-2-oxoethyl]sulfanyl-1,3,4-thiadiazol-2-yl]thiophene-2-carboxamide N-[5-[[2-(2,6-dimethylpiperidino)-2-keto-ethyl]thio]-1,3,4-thiadiazol-2-yl]thiophene-2-carboxamide Thiophene-2-carboxylic acid {5-[2-(2,6-dimethyl-piperidin-1-yl)-2-oxo-ethylsulfanyl]-[1,3,4]thiadiazol-2-yl}-amide | cid_648765
Type:
Small organic molecule
Emp. Form.:
C16H20N4O2S3
Mol. Mass.:
396.551
SMILES:
CC1CCCC(C)N1C(=O)CSc1nnc(NC(=O)c2cccs2)s1
: