Target
Beta-lactamase
Ligand
BDBM40948
Substrate
Meas. Tech.
FRET-based counterscreen for selective VIM-2 inhibitors: dose response biochemical high throughput screening assay to identify inhibitors of IMP-1 metallo-beta-lactamase.
IC50
59640±n/a nM
Citation
 PubChem, PC FRET-based counterscreen for selective VIM-2 inhibitors: dose response biochemical high throughput screening assay to identify inhibitors of IMP-1 metallo-beta-lactamase. PubChem Bioassay (2009)[AID] 
Target
Name:
Beta-lactamase
Synonyms:
Beta-lactamase | metallo-beta-lactamase IMP-1
Type:
Enzyme Catalytic Domain
Mol. Mass.:
27125.88
Organism:
Pseudomonas aeruginosa
Description:
gi_27368096
Residue:
246
  
Inhibitor
Name:
BDBM40948
Synonyms:
1-(1-naphthalenyl)ethenylphosphonic acid 1-naphthalen-1-ylethenylphosphonic acid SMR000038809 | cid_657859
Type:
Small organic molecule
Emp. Form.:
C12H11O3P
Mol. Mass.:
234.1877
SMILES:
OP(O)(=O)C(=C)c1cccc2ccccc12
: