Target
Beta-lactamase
Ligand
BDBM52019
Substrate
Meas. Tech.
FRET-based counterscreen for selective VIM-2 inhibitors: dose response biochemical high throughput screening assay to identify inhibitors of IMP-1 metallo-beta-lactamase.
IC50
59640±n/a nM
Citation
 PubChem, PC FRET-based counterscreen for selective VIM-2 inhibitors: dose response biochemical high throughput screening assay to identify inhibitors of IMP-1 metallo-beta-lactamase. PubChem Bioassay (2009)[AID] 
Target
Name:
Beta-lactamase
Synonyms:
Beta-lactamase | metallo-beta-lactamase IMP-1
Type:
Enzyme Catalytic Domain
Mol. Mass.:
27125.88
Organism:
Pseudomonas aeruginosa
Description:
gi_27368096
Residue:
246
  
Inhibitor
Name:
BDBM52019
Synonyms:
3-(2-furanyl)-4-(2-methoxyphenyl)-1H-1,2,4-triazole-5-thione 3-(furan-2-yl)-4-(2-methoxyphenyl)-1H-1,2,4-triazole-5-thione SMR000543608 | cid_973894
Type:
Small organic molecule
Emp. Form.:
C13H11N3O2S
Mol. Mass.:
273.31
SMILES:
COc1ccccc1-n1c(n[nH]c1=S)-c1ccco1
: