Target
Zinc finger protein mex-5
Ligand
BDBM52080
Substrate
Meas. Tech.
Fluorescent Polarization Homogeneous Dose Response HTS to Indentify Inhibitors of Mex-5 Binding to TCR-2
EC50
300000±n/a nM
Citation
 PubChem, PC Fluorescent Polarization Homogeneous Dose Response HTS to Indentify Inhibitors of Mex-5 Binding to TCR-2 PubChem Bioassay (2009)[AID] 
Target
Name:
Zinc finger protein mex-5
Synonyms:
MEX5_CAEEL mex-5
Type:
Enzyme Catalytic Domain
Mol. Mass.:
52832.78
Organism:
Caenorhabditis elegans
Description:
gi_55976631
Residue:
468
  
Inhibitor
Name:
BDBM52080
Synonyms:
6-Amino-8-pyridin-3-yl-8,8a-dihydro-1H,3H-isochromene-5,7,7-tricarbonitrile 6-amino-8-(3-pyridyl)-1,3,8,8a-tetrahydroisochromene-5,7,7-tricarbonitrile 6-azanyl-8-pyridin-3-yl-1,3,8,8a-tetrahydroisochromene-5,7,7-tricarbonitrile SMR000014536 | cid_654620
Type:
Small organic molecule
Emp. Form.:
C17H13N5O
Mol. Mass.:
303.318
SMILES:
N=C1C(C#N)=C2CCOCC2C(c2cccnc2)C1(C#N)C#N
: