Target
Zinc finger protein mex-5
Ligand
BDBM48240
Substrate
Meas. Tech.
Fluorescent Polarization Homogeneous Dose Response HTS to Indentify Inhibitors of Mex-5 Binding to TCR-2
EC50
10614±n/a nM
Citation
 PubChem, PC Fluorescent Polarization Homogeneous Dose Response HTS to Indentify Inhibitors of Mex-5 Binding to TCR-2 PubChem Bioassay (2009)[AID] 
Target
Name:
Zinc finger protein mex-5
Synonyms:
MEX5_CAEEL mex-5
Type:
Enzyme Catalytic Domain
Mol. Mass.:
52832.78
Organism:
Caenorhabditis elegans
Description:
gi_55976631
Residue:
468
  
Inhibitor
Name:
BDBM48240
Synonyms:
2-Phenyl-6,7,8,9-tetrahydro-benzo[e]imidazo[1,2-b][1,2,4]triazine MLS000554665 cid_619518
Type:
Small organic molecule
Emp. Form.:
C15H14N4
Mol. Mass.:
250.2985
SMILES:
C1CCc2nn3cc(nc3nc2C1)-c1ccccc1
: