Target
Zinc finger protein mex-5
Ligand
BDBM52267
Substrate
Meas. Tech.
Fluorescent Polarization Homogeneous Dose Response HTS to Indentify Inhibitors of Mex-5 Binding to TCR-2
EC50
300000±n/a nM
Citation
 PubChem, PC Fluorescent Polarization Homogeneous Dose Response HTS to Indentify Inhibitors of Mex-5 Binding to TCR-2 PubChem Bioassay (2009)[AID] 
Target
Name:
Zinc finger protein mex-5
Synonyms:
MEX5_CAEEL mex-5
Type:
Enzyme Catalytic Domain
Mol. Mass.:
52832.78
Organism:
Caenorhabditis elegans
Description:
gi_55976631
Residue:
468
  
Inhibitor
Name:
BDBM52267
Synonyms:
6-amino-5-cyano-4-(4-hydroxy-3-methoxy-phenyl)-2-methyl-4H-pyran-3-carboxylic acid ethyl ester MLS000530182 cid_2831070 ethyl 6-azanyl-5-cyano-4-(3-methoxy-4-oxidanyl-phenyl)-2-methyl-4H-pyran-3-carboxylate
Type:
Small organic molecule
Emp. Form.:
C17H18N2O5
Mol. Mass.:
330.3352
SMILES:
CCOC(=O)C1=C(C)OC(=N)C(C#N)C1c1ccc(O)c(OC)c1
: