Target
POsterior Segregation
Ligand
BDBM53206
Substrate
Meas. Tech.
Fluorescent Polarization Homogeneous Dose Response HTS to Indentify Inhibitors of POS-1 Binding to mex-3-RNA
EC50
49794±n/a nM
Citation
 PubChem, PC Fluorescent Polarization Homogeneous Dose Response HTS to Indentify Inhibitors of POS-1 Binding to mex-3-RNA PubChem Bioassay (2009)[AID] 
Target
Name:
POsterior Segregation
Synonyms:
POsterior Segregation family member (pos-1)
Type:
Enzyme Catalytic Domain
Mol. Mass.:
29838.90
Organism:
Caenorhabditis elegans
Description:
gi_17562800
Residue:
264
  
Inhibitor
Name:
BDBM53206
Synonyms:
(6R,7R)-7-[[2-(2-amino-1,3-thiazol-4-yl)-2-hydroxyiminoacetyl]amino]-3-ethenyl-8-oxo-5-thia-1-azabicyclo[4.2.0]oct-2-ene-2-carboxylic acid (6R,7R)-7-[[2-(2-aminothiazol-4-yl)-2-hydroximino-acetyl]amino]-8-keto-3-vinyl-5-thia-1-azabicyclo[4.2.0]oct-2-ene-2-carboxylic acid CEFDINIR SMR000469224 | cid_6398970
Type:
Small organic molecule
Emp. Form.:
C14H13N5O5S2
Mol. Mass.:
395.414
SMILES:
Nc1nc(cs1)C(N=O)C(=O)N[C@H]1[C@H]2SCC(C=C)=C(N2C1=O)C(O)=O
: