Target
POsterior Segregation
Ligand
BDBM50756
Substrate
Meas. Tech.
Fluorescent Polarization Homogeneous Dose Response HTS to Indentify Inhibitors of POS-1 Binding to mex-3-RNA
EC50
2180±n/a nM
Citation
 PubChem, PC Fluorescent Polarization Homogeneous Dose Response HTS to Indentify Inhibitors of POS-1 Binding to mex-3-RNA PubChem Bioassay (2009)[AID] 
Target
Name:
POsterior Segregation
Synonyms:
POsterior Segregation family member (pos-1)
Type:
Enzyme Catalytic Domain
Mol. Mass.:
29838.90
Organism:
Caenorhabditis elegans
Description:
gi_17562800
Residue:
264
  
Inhibitor
Name:
BDBM50756
Synonyms:
6-Amino-8-(2,3-dimethoxy-phenyl)-2-methyl-2,3,8,8a-tetrahydro-1H-isoquinoline-5,7,7-tricarbonitrile 6-azanyl-8-(2,3-dimethoxyphenyl)-2-methyl-1,3,8,8a-tetrahydroisoquinoline-5,7,7-tricarbonitrile SMR000013977 | cid_648447
Type:
Small organic molecule
Emp. Form.:
C21H21N5O2
Mol. Mass.:
375.4237
SMILES:
COc1cccc(C2C3CN(C)CCC3=C(C#N)C(=N)C2(C#N)C#N)c1OC
: