Target
POsterior Segregation
Ligand
BDBM34261
Substrate
Meas. Tech.
Fluorescent Polarization Homogeneous Dose Response HTS to Indentify Inhibitors of POS-1 Binding to mex-3-RNA
EC50
300000±n/a nM
Citation
 PubChem, PC Fluorescent Polarization Homogeneous Dose Response HTS to Indentify Inhibitors of POS-1 Binding to mex-3-RNA PubChem Bioassay (2009)[AID] 
Target
Name:
POsterior Segregation
Synonyms:
POsterior Segregation family member (pos-1)
Type:
Enzyme Catalytic Domain
Mol. Mass.:
29838.90
Organism:
Caenorhabditis elegans
Description:
gi_17562800
Residue:
264
  
Inhibitor
Name:
BDBM34261
Synonyms:
(5Z)-1-[2-(1-cyclohexenyl)ethyl]-5-[[4-(dimethylamino)anilino]methylidene]-1,3-diazinane-2,4,6-trione (5Z)-1-[2-(cyclohexen-1-yl)ethyl]-5-[[4-(dimethylamino)anilino]methylidene]-1,3-diazinane-2,4,6-trione MLS000083193 cid_5389548
Type:
Small organic molecule
Emp. Form.:
C21H26N4O3
Mol. Mass.:
382.4561
SMILES:
CN(C)c1ccc(NC=C2C(=O)NC(=O)N(CCC3=CCCCC3)C2=O)cc1
: