Target
POsterior Segregation
Ligand
BDBM52200
Substrate
Meas. Tech.
Fluorescent Polarization Homogeneous Dose Response HTS to Indentify Inhibitors of POS-1 Binding to mex-3-RNA
EC50
34144±n/a nM
Citation
 PubChem, PC Fluorescent Polarization Homogeneous Dose Response HTS to Indentify Inhibitors of POS-1 Binding to mex-3-RNA PubChem Bioassay (2009)[AID] 
Target
Name:
POsterior Segregation
Synonyms:
POsterior Segregation family member (pos-1)
Type:
Enzyme Catalytic Domain
Mol. Mass.:
29838.90
Organism:
Caenorhabditis elegans
Description:
gi_17562800
Residue:
264
  
Inhibitor
Name:
BDBM52200
Synonyms:
2-(5-chloro-1,3-dioxo-3a,4,7,7a-tetrahydroisoindol-2-yl)-N-(phenylmethyl)acetamide MLS000109240 N-benzyl-2-(5-chloro-1,3-dioxo-3a,4,7,7a-tetrahydroisoindol-2-yl)acetamide cid_2870963
Type:
Small organic molecule
Emp. Form.:
C17H17ClN2O3
Mol. Mass.:
332.781
SMILES:
ClC1=CCC2C(C1)C(=O)N(CC(=O)NCc1ccccc1)C2=O
: