Target
Dual specificity protein phosphatase 6
Ligand
BDBM31044
Substrate
Meas. Tech.
MKP-3 in vitro HTS assay
IC50
1980±n/a nM
Citation
 PubChem, PC MKP-3 in vitro HTS assay PubChem Bioassay (2009)[AID] 
Target
Name:
Dual specificity protein phosphatase 6
Synonyms:
DUS6_RAT MAP kinase phosphatase 3 Mitogen-activated protein kinase phosphatase 3 | Mkp3
Type:
Enzyme
Mol. Mass.:
42303.19
Organism:
Rattus norvegicus
Description:
gi_16758752
Residue:
381
  
Inhibitor
Name:
BDBM31044
Synonyms:
1-Ethyl-6-methyl-3-thiophen-2-yl-1H-pyrimido[5,4-e][1,2,4]triazine-5,7-dione 1-ethyl-6-methyl-3-thiophen-2-yl-pyrimido[5,4-e][1,2,4]triazine-5,7-dione MLS000033110 US9073941, 610 | cid_653297
Type:
Small organic molecule
Emp. Form.:
C12H11N5O2S
Mol. Mass.:
289.313
SMILES:
CCn1nc(nc2c1nc(=O)n(C)c2=O)-c1cccs1
: