Target
Dual specificity protein phosphatase 6
Ligand
BDBM53488
Substrate
Meas. Tech.
MKP-3 in vitro HTS assay
IC50
100000±n/a nM
Citation
 PubChem, PC MKP-3 in vitro HTS assay PubChem Bioassay (2009)[AID] 
Target
Name:
Dual specificity protein phosphatase 6
Synonyms:
DUS6_RAT MAP kinase phosphatase 3 Mitogen-activated protein kinase phosphatase 3 | Mkp3
Type:
Enzyme
Mol. Mass.:
42303.19
Organism:
Rattus norvegicus
Description:
gi_16758752
Residue:
381
  
Inhibitor
Name:
BDBM53488
Synonyms:
(8S,9R,10S,11S,13S,14S,16S,17R)-9-chloranyl-10,13,16-trimethyl-11,17-bis(oxidanyl)-17-(2-oxidanylethanoyl)-6,7,8,11,12,14,15,16-octahydrocyclopenta[a]phenanthren-3-one (8S,9R,10S,11S,13S,14S,16S,17R)-9-chloro-11,17-dihydroxy-17-(2-hydroxyacetyl)-10,13,16-trimethyl-6,7,8,11,12,14,15,16-octahydrocyclopenta[a]phenanthren-3-one BECLOMETHASONE SMR000058899 | cid_20469
Type:
Small organic molecule
Emp. Form.:
C22H29ClO5
Mol. Mass.:
408.916
SMILES:
C[C@H]1C[C@H]2[C@@H]3CCC4=CC(=O)C=C[C@]4(C)[C@@]3(Cl)[C@@H](O)C[C@]2(C)[C@@]1(O)C(=O)CO
: