Target
Dual specificity protein phosphatase 6
Ligand
BDBM31754
Substrate
Meas. Tech.
MKP-3 in vitro HTS assay
IC50
11000±n/a nM
Citation
 PubChem, PC MKP-3 in vitro HTS assay PubChem Bioassay (2009)[AID] 
Target
Name:
Dual specificity protein phosphatase 6
Synonyms:
DUS6_RAT MAP kinase phosphatase 3 Mitogen-activated protein kinase phosphatase 3 | Mkp3
Type:
Enzyme
Mol. Mass.:
42303.19
Organism:
Rattus norvegicus
Description:
gi_16758752
Residue:
381
  
Inhibitor
Name:
BDBM31754
Synonyms:
MLS-0010366.0001 N-(5-phenyl-1,2,4-thiadiazol-3-yl)-2-[(5-phenyl-[1,3]thiazolo[2,3-c][1,2,4]triazol-3-yl)sulfanyl]acetamide N-(5-phenyl-1,2,4-thiadiazol-3-yl)-2-[(5-phenylthiazolo[2,3-c][1,2,4]triazol-3-yl)thio]acetamide | cid_1589738
Type:
Small organic molecule
Emp. Form.:
C20H14N6OS3
Mol. Mass.:
450.56
SMILES:
O=C(CSc1nnc2scc(-c3ccccc3)n12)Nc1nsc(n1)-c1ccccc1
: