Target
Tyrosine-protein phosphatase non-receptor type 7
Ligand
BDBM39936
Substrate
Meas. Tech.
HTS Discovery of Chemical Inhibitors of HePTP, a Leukemia Target
IC50
8250±n/a nM
Citation
 PubChem, PC HTS Discovery of Chemical Inhibitors of HePTP, a Leukemia Target PubChem Bioassay (2008)[AID] 
Target
Name:
Tyrosine-protein phosphatase non-receptor type 7
Synonyms:
He-PTP Hematopoietic protein-tyrosine phosphatase (HEPTP) PTPN7 Tyrosine-protein phosphatase non-receptor type 7 | Tyrosine-protein phosphatase non-receptor type 7 (HEPTP)
Type:
Protein
Mol. Mass.:
40530.79
Organism:
Homo sapiens (Human)
Description:
P35236
Residue:
360
  
Inhibitor
Name:
BDBM39936
Synonyms:
(3aR,6aS)-3-(2-chlorophenyl)-5-(2,5-dimethoxyphenyl)-3a,6a-dihydropyrrol[3,4-d]isoxazole-4,6-quinone (3aR,6aS)-3-(2-chlorophenyl)-5-(2,5-dimethoxyphenyl)-3a,6a-dihydropyrrolo[3,4-d]isoxazole-4,6-dione SMR000046218 | cid_665287
Type:
Small organic molecule
Emp. Form.:
C19H15ClN2O5
Mol. Mass.:
386.786
SMILES:
COc1ccc(OC)c(c1)-n1c(O)c2o[nH]c(-c3ccccc3Cl)c2c1=O
: