Target
Tyrosine-protein phosphatase non-receptor type 7
Ligand
BDBM53545
Substrate
Meas. Tech.
HTS Discovery of Chemical Inhibitors of HePTP, a Leukemia Target
IC50
100000±n/a nM
Citation
 PubChem, PC HTS Discovery of Chemical Inhibitors of HePTP, a Leukemia Target PubChem Bioassay (2008)[AID] 
Target
Name:
Tyrosine-protein phosphatase non-receptor type 7
Synonyms:
He-PTP Hematopoietic protein-tyrosine phosphatase (HEPTP) PTPN7 Tyrosine-protein phosphatase non-receptor type 7 | Tyrosine-protein phosphatase non-receptor type 7 (HEPTP)
Type:
Protein
Mol. Mass.:
40530.79
Organism:
Homo sapiens (Human)
Description:
P35236
Residue:
360
  
Inhibitor
Name:
BDBM53545
Synonyms:
2-[4-(2-fluorophenyl)-1-piperazinyl]-N-(4-methoxyphenyl)acetamide 2-[4-(2-fluorophenyl)piperazin-1-yl]-N-(4-methoxyphenyl)ethanamide MLS000047416 cid_759055
Type:
Small organic molecule
Emp. Form.:
C19H22FN3O2
Mol. Mass.:
343.3953
SMILES:
COc1ccc(NC(=O)CN2CCN(CC2)c2ccccc2F)cc1
: