Target
Tyrosine-protein phosphatase non-receptor type 7
Ligand
BDBM53552
Substrate
Meas. Tech.
HTS Discovery of Chemical Inhibitors of HePTP, a Leukemia Target
IC50
100000±n/a nM
Citation
 PubChem, PC HTS Discovery of Chemical Inhibitors of HePTP, a Leukemia Target PubChem Bioassay (2008)[AID] 
Target
Name:
Tyrosine-protein phosphatase non-receptor type 7
Synonyms:
He-PTP Hematopoietic protein-tyrosine phosphatase (HEPTP) PTPN7 Tyrosine-protein phosphatase non-receptor type 7 | Tyrosine-protein phosphatase non-receptor type 7 (HEPTP)
Type:
Protein
Mol. Mass.:
40530.79
Organism:
Homo sapiens (Human)
Description:
P35236
Residue:
360
  
Inhibitor
Name:
BDBM53552
Synonyms:
4-(2-methoxyphenoxy)-N-(2-pyridinylmethyl)benzenesulfonamide 4-(2-methoxyphenoxy)-N-(pyridin-2-ylmethyl)benzenesulfonamide SMR000072700 | cid_983975
Type:
Small organic molecule
Emp. Form.:
C19H18N2O4S
Mol. Mass.:
370.422
SMILES:
COc1ccccc1Oc1ccc(cc1)S(=O)(=O)NCc1ccccn1
: