Target
Tyrosine-protein phosphatase non-receptor type 7
Ligand
BDBM40101
Substrate
Meas. Tech.
HTS Discovery of Chemical Inhibitors of HePTP, a Leukemia Target
IC50
1170±n/a nM
Citation
 PubChem, PC HTS Discovery of Chemical Inhibitors of HePTP, a Leukemia Target PubChem Bioassay (2008)[AID] 
Target
Name:
Tyrosine-protein phosphatase non-receptor type 7
Synonyms:
He-PTP Hematopoietic protein-tyrosine phosphatase (HEPTP) PTPN7 Tyrosine-protein phosphatase non-receptor type 7 | Tyrosine-protein phosphatase non-receptor type 7 (HEPTP)
Type:
Protein
Mol. Mass.:
40530.79
Organism:
Homo sapiens (Human)
Description:
P35236
Residue:
360
  
Inhibitor
Name:
BDBM40101
Synonyms:
2-(4-methoxyphenyl)-3-oxidanylidene-1H-isoindole-4-carboxylic acid 3-keto-2-(4-methoxyphenyl)isoindoline-4-carboxylic acid SMR000097540 | cid_5309875
Type:
Small organic molecule
Emp. Form.:
C16H13NO4
Mol. Mass.:
283.2787
SMILES:
COc1ccc(cc1)N1Cc2cccc(C(O)=O)c2C1=O
: