Target
Heat shock cognate 71 kDa protein
Ligand
BDBM31718
Substrate
Meas. Tech.
High Throughput Screening Assay for Hsc70 Inhibitors
IC50
999000±n/a nM
Citation
 PubChem, PC High Throughput Screening Assay for Hsc70 Inhibitors PubChem Bioassay (2007)[AID] 
Target
Name:
Heat shock cognate 71 kDa protein
Synonyms:
HSC70 HSP7C_HUMAN HSPA8 heat shock 70kDa protein 8 isoform 2
Type:
Enzyme Catalytic Domain
Mol. Mass.:
70887.67
Organism:
Homo sapiens (Human)
Description:
gi_5729877
Residue:
646
  
Inhibitor
Name:
BDBM31718
Synonyms:
2-[[1-oxo-2-[[1-oxo-2-(1-oxo-2-isoquinolinyl)ethyl]amino]ethyl]amino]acetic acid ethyl ester MLS000519883 cid_9551519 ethyl 2-[[2-[[2-(1-oxoisoquinolin-2-yl)acetyl]amino]acetyl]amino]acetate
Type:
Small organic molecule
Emp. Form.:
C17H19N3O5
Mol. Mass.:
345.3499
SMILES:
CCOC(=O)CNC(=O)CNC(=O)Cn1ccc2ccccc2c1=O
: