Target
Integrin alpha-4
Ligand
BDBM30857
Substrate
Meas. Tech.
Dose-Response of Allosteric Antagonists for the VLA-4 Integrin
EC50
33860±n/a nM
Citation
 PubChem, PC Dose-Response of Allosteric Antagonists for the VLA-4 Integrin PubChem Bioassay (2007)[AID] 
Target
Name:
Integrin alpha-4
Synonyms:
CD49 antigen-like family member D CD49d antigen ITA4_HUMAN Integrin alpha-4 Integrin alpha-IV VLA-4 integrin alpha 4 precursor | integrin alpha-4 precursor
Type:
Membrane Protein
Mol. Mass.:
114897.35
Organism:
Homo sapiens (Human)
Description:
P13612
Residue:
1032
  
Inhibitor
Name:
BDBM30857
Synonyms:
2-[(4-methoxy-1,3-benzothiazol-2-yl)amino]-4-methyl-5-thiazolecarboxylic acid ethyl ester MLS000045453 cid_3238591 | ethyl 2-[(4-methoxy-1,3-benzothiazol-2-yl)amino]-4-methyl-1,3-thiazole-5-carboxylate
Type:
Small organic molecule
Emp. Form.:
C15H15N3O3S2
Mol. Mass.:
349.428
SMILES:
CCOC(=O)c1sc(Nc2nc3c(OC)cccc3s2)nc1C
: