Target
Mannose-6-phosphate isomerase
Ligand
BDBM34591
Substrate
Meas. Tech.
HTS identification of compounds inhibiting phosphomannose isomerase (PMI) via a fluorescence intensity assay.
IC50
50000±n/a nM
Citation
 PubChem, PC HTS identification of compounds inhibiting phosphomannose isomerase (PMI) via a fluorescence intensity assay. PubChem Bioassay (2009)[AID] 
Target
Name:
Mannose-6-phosphate isomerase
Synonyms:
MPI MPI_HUMAN PMI1
Type:
PROTEIN
Mol. Mass.:
46651.35
Organism:
Homo sapiens (Human)
Description:
ChEMBL_1448919
Residue:
423
  
Inhibitor
Name:
BDBM34591
Synonyms:
6-(benzylsulfanylmethyl)imidazo[2,1-b][1,3]thiazole 6-[(phenylmethylsulfanyl)methyl]imidazo[2,1-b][1,3]thiazole MLS000054247 cid_2997803
Type:
Small organic molecule
Emp. Form.:
C13H12N2S2
Mol. Mass.:
260.378
SMILES:
C(SCc1ccccc1)c1cn2ccsc2n1
: