Target
Mannose-6-phosphate isomerase
Ligand
BDBM34612
Substrate
Meas. Tech.
HTS identification of compounds inhibiting phosphomannose isomerase (PMI) via a fluorescence intensity assay.
IC50
47835±n/a nM
Citation
 PubChem, PC HTS identification of compounds inhibiting phosphomannose isomerase (PMI) via a fluorescence intensity assay. PubChem Bioassay (2009)[AID] 
Target
Name:
Mannose-6-phosphate isomerase
Synonyms:
MPI MPI_HUMAN PMI1
Type:
PROTEIN
Mol. Mass.:
46651.35
Organism:
Homo sapiens (Human)
Description:
ChEMBL_1448919
Residue:
423
  
Inhibitor
Name:
BDBM34612
Synonyms:
1-methyl-3,4-dihydro-2H-beta-carboline;picric acid 2-methylbenzo[g][1,3]benzoxazole;picric acid MLS000047780 cid_3241713
Type:
Small organic molecule
Emp. Form.:
C6H3N3O7
Mol. Mass.:
229.1039
SMILES:
Oc1c(cc(cc1[N+]([O-])=O)[N+]([O-])=O)[N+]([O-])=O
: