Target
Mannose-6-phosphate isomerase
Ligand
BDBM34721
Substrate
Meas. Tech.
HTS identification of compounds inhibiting phosphomannose isomerase (PMI) via a fluorescence intensity assay.
IC50
50000±n/a nM
Citation
 PubChem, PC HTS identification of compounds inhibiting phosphomannose isomerase (PMI) via a fluorescence intensity assay. PubChem Bioassay (2009)[AID] 
Target
Name:
Mannose-6-phosphate isomerase
Synonyms:
MPI MPI_HUMAN PMI1
Type:
PROTEIN
Mol. Mass.:
46651.35
Organism:
Homo sapiens (Human)
Description:
ChEMBL_1448919
Residue:
423
  
Inhibitor
Name:
BDBM34721
Synonyms:
(2E)-2-[(2-methyl-5-nitro-anilino)methylene]tetralin-1-one (2E)-2-[[(2-methyl-5-nitro-phenyl)amino]methylidene]-3,4-dihydronaphthalen-1-one MLS000552376 cid_765348
Type:
Small organic molecule
Emp. Form.:
C18H16N2O3
Mol. Mass.:
308.3312
SMILES:
Cc1ccc(cc1NC=C1CCc2ccccc2C1=O)[N+]([O-])=O
: