Target
Mannose-6-phosphate isomerase
Ligand
BDBM53603
Substrate
Meas. Tech.
HTS identification of compounds inhibiting phosphomannose isomerase (PMI) via a fluorescence intensity assay.
IC50
50000±n/a nM
Citation
 PubChem, PC HTS identification of compounds inhibiting phosphomannose isomerase (PMI) via a fluorescence intensity assay. PubChem Bioassay (2009)[AID] 
Target
Name:
Mannose-6-phosphate isomerase
Synonyms:
MPI MPI_HUMAN PMI1
Type:
PROTEIN
Mol. Mass.:
46651.35
Organism:
Homo sapiens (Human)
Description:
ChEMBL_1448919
Residue:
423
  
Inhibitor
Name:
BDBM53603
Synonyms:
4-({4-[(2,4-dichlorobenzyl)oxy]-3-ethoxybenzyl}amino)phenol 4-[[4-[(2,4-dichlorophenyl)methoxy]-3-ethoxy-phenyl]methylamino]phenol MLS000580515 cid_1807346
Type:
Small organic molecule
Emp. Form.:
C22H21Cl2NO3
Mol. Mass.:
418.313
SMILES:
CCOc1cc(CNc2ccc(O)cc2)ccc1OCc1ccc(Cl)cc1Cl
: