Target
Mannose-6-phosphate isomerase
Ligand
BDBM34849
Substrate
Meas. Tech.
HTS identification of compounds inhibiting phosphomannose isomerase (PMI) via a fluorescence intensity assay.
IC50
2905.4±n/a nM
Citation
 PubChem, PC HTS identification of compounds inhibiting phosphomannose isomerase (PMI) via a fluorescence intensity assay. PubChem Bioassay (2009)[AID] 
Target
Name:
Mannose-6-phosphate isomerase
Synonyms:
MPI MPI_HUMAN PMI1
Type:
PROTEIN
Mol. Mass.:
46651.35
Organism:
Homo sapiens (Human)
Description:
ChEMBL_1448919
Residue:
423
  
Inhibitor
Name:
BDBM34849
Synonyms:
6-fluoranyl-2-(2-methylphenyl)-1,2-benzothiazol-3-one 6-fluoro-2-(2-methylphenyl)-1,2-benzothiazol-3-one MLS000729299 cid_1510379
Type:
Small organic molecule
Emp. Form.:
C14H10FNOS
Mol. Mass.:
259.299
SMILES:
Cc1ccccc1-n1sc2cc(F)ccc2c1=O
: