Target
Mannose-6-phosphate isomerase
Ligand
BDBM34869
Substrate
Meas. Tech.
HTS identification of compounds inhibiting phosphomannose isomerase (PMI) via a fluorescence intensity assay.
IC50
36259±n/a nM
Citation
 PubChem, PC HTS identification of compounds inhibiting phosphomannose isomerase (PMI) via a fluorescence intensity assay. PubChem Bioassay (2009)[AID] 
Target
Name:
Mannose-6-phosphate isomerase
Synonyms:
MPI MPI_HUMAN PMI1
Type:
PROTEIN
Mol. Mass.:
46651.35
Organism:
Homo sapiens (Human)
Description:
ChEMBL_1448919
Residue:
423
  
Inhibitor
Name:
BDBM34869
Synonyms:
9-Mercapto-8-m-tolyl-5,8-dihydro-6H-11-thia-8,10-diaza-benzo[a]fluoren-7-one SMR000211329 | cid_1388232
Type:
Small organic molecule
Emp. Form.:
C21H16N2OS2
Mol. Mass.:
376.495
SMILES:
Cc1cccc(c1)-n1c(=S)[nH]c2sc-3c(CCc4ccccc-34)c2c1=O
: