Target
Mannose-6-phosphate isomerase
Ligand
BDBM53632
Substrate
Meas. Tech.
HTS identification of compounds inhibiting phosphomannose isomerase (PMI) via a fluorescence intensity assay.
IC50
50000±n/a nM
Citation
 PubChem, PC HTS identification of compounds inhibiting phosphomannose isomerase (PMI) via a fluorescence intensity assay. PubChem Bioassay (2009)[AID] 
Target
Name:
Mannose-6-phosphate isomerase
Synonyms:
MPI MPI_HUMAN PMI1
Type:
PROTEIN
Mol. Mass.:
46651.35
Organism:
Homo sapiens (Human)
Description:
ChEMBL_1448919
Residue:
423
  
Inhibitor
Name:
BDBM53632
Synonyms:
(2E)-2-[(2Z)-2-(3-hydroxy-4-keto-cyclohexa-2,5-dien-1-ylidene)ethylidene]-3-(3-methoxyphenyl)-1H-quinazolin-4-one (2E)-2-[(2Z)-2-(3-hydroxy-4-oxocyclohexa-2,5-dien-1-ylidene)ethylidene]-3-(3-methoxyphenyl)-1H-quinazolin-4-one MLS000713974 cid_5763876
Type:
Small organic molecule
Emp. Form.:
C23H18N2O4
Mol. Mass.:
386.4
SMILES:
COc1cccc(c1)-n1c(C=Cc2ccc(O)c(O)c2)nc2ccccc2c1=O
: