Target
M1 family aminopeptidase
Ligand
BDBM53702
Substrate
Meas. Tech.
Inhibitors of Plasmodium falciparum M1- Family Alanyl Aminopeptidase (M1AAP)
IC50
2110±n/a nM
Citation
 PubChem, PC Inhibitors of Plasmodium falciparum M1- Family Alanyl Aminopeptidase (M1AAP) PubChem Bioassay (2008)[AID] 
Target
Name:
M1 family aminopeptidase
Synonyms:
AMPN_PLAF7 Zinc aminopeptidase | m1-family aminopeptidase
Type:
PROTEIN
Mol. Mass.:
126072.31
Organism:
Plasmodium falciparum (isolate FcB1 / Columbia)
Description:
ChEMBL_735637
Residue:
1085
  
Inhibitor
Name:
BDBM53702
Synonyms:
1-[(5-bromo-2-thienyl)sulfonyl]-N-piperonyl-isonipecotamide N-(1,3-benzodioxol-5-ylmethyl)-1-(5-bromanylthiophen-2-yl)sulfonyl-piperidine-4-carboxamide N-(1,3-benzodioxol-5-ylmethyl)-1-[(5-bromo-2-thiophenyl)sulfonyl]-4-piperidinecarboxamide SMR000025426 | cid_3245751
Type:
Small organic molecule
Emp. Form.:
C18H19BrN2O5S2
Mol. Mass.:
487.388
SMILES:
Brc1ccc(s1)S(=O)(=O)N1CCC(CC1)C(=O)NCc1ccc2OCOc2c1
: