Target
M1 family aminopeptidase
Ligand
BDBM48684
Substrate
Meas. Tech.
Inhibitors of Plasmodium falciparum M1- Family Alanyl Aminopeptidase (M1AAP)
IC50
6790±n/a nM
Citation
 PubChem, PC Inhibitors of Plasmodium falciparum M1- Family Alanyl Aminopeptidase (M1AAP) PubChem Bioassay (2008)[AID] 
Target
Name:
M1 family aminopeptidase
Synonyms:
AMPN_PLAF7 Zinc aminopeptidase | m1-family aminopeptidase
Type:
PROTEIN
Mol. Mass.:
126072.31
Organism:
Plasmodium falciparum (isolate FcB1 / Columbia)
Description:
ChEMBL_735637
Residue:
1085
  
Inhibitor
Name:
BDBM48684
Synonyms:
(6E)-2-bromanyl-6-[[2-(1-naphthalen-1-yl-1,2,3,4-tetrazol-5-yl)hydrazinyl]methylidene]-4-nitro-cyclohexa-2,4-dien-1-one (6E)-2-bromo-6-[[N'-[1-(1-naphthyl)tetrazol-5-yl]hydrazino]methylene]-4-nitro-cyclohexa-2,4-dien-1-one 2-Bromo-6-[(1-naphthalen-1-yl-1H-tetrazol-5-yl)-hydrazonomethyl]-4-nitro-phenol SMR000123076 | cid_5763525
Type:
Small organic molecule
Emp. Form.:
C18H12BrN7O3
Mol. Mass.:
454.237
SMILES:
Oc1c(Br)cc(cc1CN=Nc1nnnn1-c1cccc2ccccc12)[N+]([O-])=O
: