Target
M1 family aminopeptidase
Ligand
BDBM53883
Substrate
Meas. Tech.
Inhibitors of Plasmodium falciparum M1- Family Alanyl Aminopeptidase (M1AAP)
IC50
3450±n/a nM
Citation
 PubChem, PC Inhibitors of Plasmodium falciparum M1- Family Alanyl Aminopeptidase (M1AAP) PubChem Bioassay (2008)[AID] 
Target
Name:
M1 family aminopeptidase
Synonyms:
AMPN_PLAF7 Zinc aminopeptidase | m1-family aminopeptidase
Type:
PROTEIN
Mol. Mass.:
126072.31
Organism:
Plasmodium falciparum (isolate FcB1 / Columbia)
Description:
ChEMBL_735637
Residue:
1085
  
Inhibitor
Name:
BDBM53883
Synonyms:
4-amino-N'-[(E)-(3-bromo-6-keto-cyclohexa-2,4-dien-1-ylidene)methyl]furazan-3-carbohydrazide;hydrochloride 4-amino-N'-[(E)-(3-bromo-6-oxocyclohexa-2,4-dien-1-ylidene)methyl]-1,2,5-oxadiazole-3-carbohydrazide;hydrochloride MLS000713386 cid_16187400
Type:
Small organic molecule
Emp. Form.:
C10H8BrN5O3
Mol. Mass.:
326.106
SMILES:
Nc1nonc1C(=O)NN=Cc1cc(Br)ccc1O
: