Target
M1 family aminopeptidase
Ligand
BDBM54144
Substrate
Meas. Tech.
Inhibitors of Plasmodium falciparum M1- Family Alanyl Aminopeptidase (M1AAP)
IC50
17130±n/a nM
Citation
 PubChem, PC Inhibitors of Plasmodium falciparum M1- Family Alanyl Aminopeptidase (M1AAP) PubChem Bioassay (2008)[AID] 
Target
Name:
M1 family aminopeptidase
Synonyms:
AMPN_PLAF7 Zinc aminopeptidase | m1-family aminopeptidase
Type:
PROTEIN
Mol. Mass.:
126072.31
Organism:
Plasmodium falciparum (isolate FcB1 / Columbia)
Description:
ChEMBL_735637
Residue:
1085
  
Inhibitor
Name:
BDBM54144
Synonyms:
2-(2-{[3-(1,3-benzothiazol-2-yl)-4-methyl-2-thienyl]amino}-2-oxoethoxy)acetic acid 2-[2-[[3-(1,3-benzothiazol-2-yl)-4-methyl-2-thiophenyl]amino]-2-oxoethoxy]acetic acid 2-[2-[[3-(1,3-benzothiazol-2-yl)-4-methylthiophen-2-yl]amino]-2-oxoethoxy]acetic acid SMR000456238 | cid_2811899
Type:
Small organic molecule
Emp. Form.:
C16H14N2O4S2
Mol. Mass.:
362.423
SMILES:
Cc1csc(NC(=O)COCC(O)=O)c1-c1nc2ccccc2s1
: