Target
Nucleotide-binding oligomerization domain-containing protein 2
Ligand
BDBM54389
Substrate
Meas. Tech.
uHTS luminescence assay for the identification of compounds that inhibit NOD2 in MDP treated cells
IC50
1273±n/a nM
Citation
 PubChem, PC uHTS luminescence assay for the identification of compounds that inhibit NOD2 in MDP treated cells PubChem Bioassay (2010)[AID] 
Target
Name:
Nucleotide-binding oligomerization domain-containing protein 2
Synonyms:
CARD15 IBD1 NOD2 Nucleotide-binding oligomerization domain-containing protein 2 | nucleotide-binding oligomerization domain containing 2
Type:
PROTEIN
Mol. Mass.:
115287.18
Organism:
Homo sapiens (Human)
Description:
ChEMBL_1454053
Residue:
1040
  
Inhibitor
Name:
BDBM54389
Synonyms:
4-(3,4-dihydro-1H-isoquinolin-2-yl)-8-fluoranyl-5H-pyrimido[5,4-b]indole 4-(3,4-dihydro-1H-isoquinolin-2-yl)-8-fluoro-5H-pyrimido[5,4-b]indole SMR000431674 | cid_920148
Type:
Small organic molecule
Emp. Form.:
C19H15FN4
Mol. Mass.:
318.3476
SMILES:
Fc1ccc2[nH]c3c(ncnc3c2c1)N1CCc2ccccc2C1
: