Target
Cell division control protein 42 homolog
Ligand
BDBM54616
Substrate
Meas. Tech.
Pyrazoline SAR compounds tested via Multiplex dose response to identify specific small molecule inhibitors of Ras and Ras-related GTPases specifically Cdc42 wildtype protein
EC50
30000±n/a nM
Citation
 PubChem, PC Pyrazoline SAR compounds tested via Multiplex dose response to identify specific small molecule inhibitors of Ras and Ras-related GTPases specifically Cdc42 wildtype protein PubChem Bioassay (2009)[AID] 
Target
Name:
Cell division control protein 42 homolog
Synonyms:
CDC42 Cell division control protein 42 homolog cell division cycle 42 (GTP binding protein, 25kDa)
Type:
PROTEIN
Mol. Mass.:
21258.36
Organism:
Homo sapiens (Human)
Description:
ChEMBL_652970
Residue:
191
  
Inhibitor
Name:
BDBM54616
Synonyms:
1-(2-methoxyphenyl)-3,5-diphenyl-2-pyrazoline UNM-0000305855 | cid_2865685
Type:
Small organic molecule
Emp. Form.:
C22H20N2O
Mol. Mass.:
328.407
SMILES:
COc1ccccc1N1N=C(CC1c1ccccc1)c1ccccc1
: