Target
Cell division control protein 42 homolog
Ligand
BDBM54603
Substrate
Meas. Tech.
Pyrazoline SAR compounds tested via Multiplex dose response to identify specific small molecule inhibitors of Ras and Ras-related GTPases specifically Cdc42 activated mutant
EC50
22594±n/a nM
Citation
 PubChem, PC Pyrazoline SAR compounds tested via Multiplex dose response to identify specific small molecule inhibitors of Ras and Ras-related GTPases specifically Cdc42 activated mutant PubChem Bioassay (2009)[AID] 
Target
Name:
Cell division control protein 42 homolog
Synonyms:
CDC42 Cell division control protein 42 homolog cell division cycle 42 (GTP binding protein, 25kDa)
Type:
PROTEIN
Mol. Mass.:
21258.36
Organism:
Homo sapiens (Human)
Description:
ChEMBL_652970
Residue:
191
  
Inhibitor
Name:
BDBM54603
Synonyms:
3-(4-methoxyphenyl)-1-phenyl-5-[2-(trifluoromethyl)phenyl]-2-pyrazoline UNM-0000305841 | cid_2854040
Type:
Small organic molecule
Emp. Form.:
C23H19F3N2O
Mol. Mass.:
396.405
SMILES:
COc1ccc(cc1)C1=NN(C(C1)c1ccccc1C(F)(F)F)c1ccccc1
: