Target
Cell division control protein 42 homolog
Ligand
BDBM54695
Substrate
Meas. Tech.
Additional SAR compounds tested by Multiplex dose response to identify specific small molecule inhibitors of Ras and Ras-related GTPases specifically Cdc42 activated mutant
EC50
30000±n/a nM
Citation
 PubChem, PC Additional SAR compounds tested by Multiplex dose response to identify specific small molecule inhibitors of Ras and Ras-related GTPases specifically Cdc42 activated mutant PubChem Bioassay (2009)[AID] 
Target
Name:
Cell division control protein 42 homolog
Synonyms:
CDC42 Cell division control protein 42 homolog cell division cycle 42 (GTP binding protein, 25kDa)
Type:
PROTEIN
Mol. Mass.:
21258.36
Organism:
Homo sapiens (Human)
Description:
ChEMBL_652970
Residue:
191
  
Inhibitor
Name:
BDBM54695
Synonyms:
1,3-diphenyl-2-propyn-1-one UNM-0000306039 | cid_97637
Type:
Small organic molecule
Emp. Form.:
C15H10O
Mol. Mass.:
206.2393
SMILES:
O=C(C#Cc1ccccc1)c1ccccc1
: